﻿What exact time is it *right now* where you are? (i6lo510),currentTime,How boring or interesting was the activity that you were doing *5 minutes* ago? (6rlcce2),boringActivity5MinsAgo,I felt worried over the past five hours. (54szp73),Points (fiveHoursAnxiety),fiveHour_worried,I felt tense over the past five hours. (fsmprz8),fiveHour_tense,I felt calm over the past five hours. (4hh9fu6),fiveHour_calm,I felt relaxed over the past five hours. (pjnsv3l),fiveHour_relaxed,fiveHoursAnxietyNormalized,I felt worried last night. (699stvo),Points (lastNightAnxiety),lastNight_worried,I felt tense last night. (n63tcfb),lastNight_tense,I felt calm last night. (7ub4sl0),lastNight_calm,I felt relaxed last night. (1dqv5qr),lastNight_relaxed,lastNightAnxietyNormalized,gad7,"Feeling nervous, anxious or on edge (2tud2vf)",gad_feelingNervous,Not being able to stop or control worrying (a3ensns),gad_controlWorrying,Worrying too much about different things (n6idn0g),gad_manyWorries,Trouble relaxing (endw3lf),gad_troubleRelaxing,Being so restless that it is hard to sit still (71r9huk),gad_Restlessness,Becoming easily annoyed or irritable (b46jizi),gad_annoyedIrritable,Feeling afraid as if something awful might happen (vw223nm),gad_feelingAfraid,"On a *typical* day, how tired or sleepy do you feel throughout the day? (32uvrxs)",typicalTiredness,Are you currently sick with an illness that could cause fatigue? (e672n3k),fatigueCausingIllness,Did you stay up the entire night last night *without* sleeping? (m27wszq),stayedUpAllNight,What time did you go to bed last night? (qx456ev),bedTime,"After you *finished* sleeping last night, what time did you wake up today? (sygws4l)",wakeUpTime,calculatedHoursSlept,calculatedHoursAwake,Approximately how many hours of sleep did you get last night? (ls8t3j9),reportedHoursSlept,What is the *ideal* number of hours that *you personally* need to sleep in order to feel your best? (du3fwzx),idealHoursToSleep,Did you hear that? (o3b6yal),Was that better? (6235svr),out_soundstatus,How *happy* do you feel *right now*? (fxorhip),Points (preHappiness),pre_happiness,How *unhappy* do you feel *right now*? (k853qyd),Points (preUnhappiness),pre_unhappiness,combindedHappinessPre,How tired does your *body* feel right now? (sew1nhg),bodyTiredFSQ,How tired does your *mind* feel right now? (768bhgi),mindTiredFSQ,How awake do you feel right now? (kcl638f),notAwakeFSQ,How slow and sluggish are you right now? (5ksrg55),slowAndSluggishFSQ,fatigueStateRawScore,fatigueStateNormalizedScore,I feel worried right now. (34pf1el),Points (preAnxiety),pre_worried,I feel tense right now. (1spnjvx),pre_tense,I feel calm right now. (i95rox1),pre_calm,I feel relaxed right now. (ur1euoa),pre_relaxed,preAnxietyNormalized,Experiment (anxietyReduction),pmrIntro,pmrIntro2,controlseconds,gotControl,I feel worried right now. (d7etf6b),Points (postAnxiety),post_worried,I feel tense right now. (xfzxsid),post_tense,I feel calm right now. (rfu067f),post_calm,I feel relaxed right now. (h83kqot),post_relaxed,postAnxietyNormalized,How tired does your *body* feel right now? (fhc8q9t),bodyTiredFSQ2,How tired does your *mind* feel right now? (4jw43g3),mindTiredFSQ2,How awake do you feel right now? (8x7x1lf),notAwakeFSQ2,How slow and sluggish are you right now? (iwmt3d6),slowAndSluggishFSQ2,fatigueStateRawScore2,fatigueStateNormalizedScore2,How *happy* do you feel *right now*? (na44nsx),Points (postHappiness),post_happiness,How *unhappy* do you feel *right now*? (25h47j1),Points (postUnhappiness),post_unhappiness,combindedHappinessPost,visualizationseconds,relaxationseconds,visualizationseconds2,Can you hear it now? (n54of4z),What type of illness do you have that could cause fatigue? (iavft65),How well rested did you feel when you woke up? (jeha2p),howWellRested,How high quality would you say each hour of your sleep was last night (not taking into account how many hours you slept)? (w183el4),sleepQuality,absSleepMinusIdealSleep,combinedHappinessPre,combinedHappinessPost,"Before we start the survey, are you feeling anxious right now? (l60l55h)",Randomize (Anxiety question order)
4:20 PM,0.68,Very interesting,-2,0. Not at all,5,0,1. A little,1,2. Moderately,2,2. Moderately,1,0.3125,0. Not at all,2,0,0. Not at all,0,3. Very much,3,3. Very much,3,0.125,0,Not at all,0,Not at all,0,Not at all,0,Not at all,0,Not at all,0,Not at all,0,Not at all,0,1. A little,1,"No, I am not sick with an illness that could cause fatigue",0,"No, I did not stay up all night",0,10:21 PM,10:21 PM,7:21 AM,7:21 AM,9,8.98,7,7,7.5 hours,7.5,"Yes, and the volume was just right.",,ON,3. Very much,3,3,0. Not at all,0,0,,1. A little,1,0. Not at all,0,3. Very,1,0. Not at all,0,2,0.125,0. Not at all,5,0,0. Not at all,0,0. Not at all,0,3. Very much,3,0.3125,control1,,,360,1,0. Not at all,2,0,0. Not at all,0,3. Very much,3,3. Very much,3,0.125,1. A little,1,1. A little,1,3. Very,1,0. Not at all,0,3,0.1875,3. Very much,3,3,0. Not at all,0,0,,,,,,,3. Very,3,3. High quality each hour,3,0.5,1.5,1.5,,
4:20 PM,0.68,Very interesting,-2,0. Not at all,0,0,0. Not at all,0,4. Extremely,4,4. Extremely,4,0,0. Not at all,0,0,0. Not at all,0,4. Extremely,4,4. Extremely,4,0,0,Not at all,0,Not at all,0,Not at all,0,Not at all,0,Not at all,0,Not at all,0,Not at all,0,0. Not at all,0,"No, I am not sick with an illness that could cause fatigue",0,"No, I did not stay up all night",0,9:30 PM,9:30 PM,5:30 AM,5:30 AM,8.01,10.84,8,8,7.5 hours,7.5,"Yes, and the volume was just right.",,ON,4. Extremely,4,4,0. Not at all,0,0,,1. A little,1,0. Not at all,0,4. Extremely,0,0. Not at all,0,1,0.0625,0. Not at all,0,0,0. Not at all,0,4. Extremely,4,4. Extremely,4,0,control2,,,360,1,0. Not at all,0,0,0. Not at all,0,4. Extremely,4,4. Extremely,4,0,1. A little,1,0. Not at all,0,4. Extremely,0,0. Not at all,0,1,0.0625,4. Extremely,4,4,0. Not at all,0,0,,,,,,,4. Extremely,4,3. High quality each hour,3,0.5,2,2,,
1:20 PM,0.56,Moderatley boring,1,4. Extremely,16,4,4. Extremely,4,0. Not at all,0,0. Not at all,0,1,4. Extremely,16,4,4. Extremely,4,0. Not at all,0,0. Not at all,0,1,20,Nearly every day,3,Nearly every day,3,Nearly every day,3,Nearly every day,3,Nearly every day,3,Nearly every day,3,More than half the days,2,2. Moderately,2,"No, I am not sick with an illness that could cause fatigue",0,"No, I did not stay up all night",0,10:18 PM,10:18 PM,5:22 AM,5:22 AM,7.05,7.98,8,8,8 hours,8,"Yes, and the volume was just right.",,ON,0. Not at all,0,0,3. Very much,3,3,,3. Very,3,3. Very,3,0. Not at all,4,2. Moderately,2,12,0.75,4. Extremely,16,4,4. Extremely,4,0. Not at all,0,0. Not at all,0,1,PMR,"In this exercise, you will be tightening and relaxing muscle groups one by one, paying close attention to the difference between how they feel when tightened versus when relaxed. Many people find that this relaxation technique is surprisingly effective.","Before you begin, it's important to note that this exercise should not cause pain or discomfort. It works most effectively when your muscles are tensed at a medium-high intensity, about 70% of your strength. If you feel any discomfort, ease back until the discomfort disappears. If you find that it is painful, feel free to skip that particular muscle group. Also, remember to breathe naturally when tensing your muscles, without holding your breath.",,0,2. Moderately,10,2,2. Moderately,2,1. A little,1,1. A little,1,0.625,2. Moderately,2,2. Moderately,2,1. A little,3,2. Moderately,2,9,0.5625,1. A little,1,1,3. Very much,3,3,,,,,,,2. Moderately,2,2. Moderate quality each hour,2,0,-1.5,-1,,
4:21 PM,0.68,Moderately interesting,-1,2. Moderately,10,2,3. Very much,3,1. A little,1,2. Moderately,1,0.625,1. A little,7,1,1. A little,1,1. A little,1,2. Moderately,2,0.4375,15,More than half the days,2,More than half the days,2,More than half the days,2,Nearly every day,3,Several days,1,Nearly every day,3,More than half the days,2,2. Moderately,2,"No, I am not sick with an illness that could cause fatigue",0,"No, I did not stay up all night",0,1:23 AM,1:23 AM,9:14 AM,9:14 AM,7.85,7.11,7,7,7 hours,7,"Yes, and the volume was just right.",,ON,2. Moderately,2,2,1. A little,1,1,,1. A little,1,0. Not at all,0,2. Moderately,2,1. A little,1,4,0.25,1. A little,7,1,1. A little,1,2. Moderately,2,1. A little,1,0.4375,control1,,,360,1,0. Not at all,4,0,1. A little,1,3. Very much,3,2. Moderately,2,0.25,0. Not at all,0,0. Not at all,0,3. Very,1,0. Not at all,0,1,0.0625,2. Moderately,2,2,0. Not at all,0,0,,,,,,,2. Moderately,2,2. Moderate quality each hour,2,0,0.5,1,,
3:21 PM,0.64,Moderately interesting,-1,0. Not at all,0,0,0. Not at all,0,4. Extremely,4,4. Extremely,4,0,0. Not at all,1,0,0. Not at all,0,3. Very much,3,4. Extremely,4,0.0625,5,Several days,1,Several days,1,Several days,1,Several days,1,Not at all,0,Not at all,0,Several days,1,1. A little,1,"No, I am not sick with an illness that could cause fatigue",0,"No, I did not stay up all night",0,9:25 PM,9:25 PM,6:00 AM,6:00 AM,8.59,9.36,8,8,8 hours,8,"Yes, and the volume was just right.",,ON,3. Very much,3,3,0. Not at all,0,0,,1. A little,1,0. Not at all,0,2. Moderately,2,1. A little,1,4,0.25,0. Not at all,0,0,0. Not at all,0,4. Extremely,4,4. Extremely,4,0,PMR,"In this exercise, you will be tightening and relaxing muscle groups one by one, paying close attention to the difference between how they feel when tightened versus when relaxed. Many people find that this relaxation technique is surprisingly effective.","Before you begin, it's important to note that this exercise should not cause pain or discomfort. It works most effectively when your muscles are tensed at a medium-high intensity, about 70% of your strength. If you feel any discomfort, ease back until the discomfort disappears. If you find that it is painful, feel free to skip that particular muscle group. Also, remember to breathe naturally when tensing your muscles, without holding your breath.",,0,0. Not at all,0,0,0. Not at all,0,4. Extremely,4,4. Extremely,4,0,0. Not at all,0,0. Not at all,0,3. Very,1,0. Not at all,0,1,0.0625,3. Very much,3,3,0. Not at all,0,0,,,,,,,3. Very,3,2. Moderate quality each hour,2,0,1.5,1.5,,
4:21 PM,0.68,Moderatley boring,1,0. Not at all,2,0,0. Not at all,0,3. Very much,3,3. Very much,3,0.125,0. Not at all,0,0,0. Not at all,0,4. Extremely,4,4. Extremely,4,0,0,Not at all,0,Not at all,0,Not at all,0,Not at all,0,Not at all,0,Not at all,0,Not at all,0,1. A little,1,"No, I am not sick with an illness that could cause fatigue",0,"No, I did not stay up all night",0,5:27 AM,5:27 AM,11:45 AM,11:45 AM,6.7,4.61,6,6,7 hours,7,"Yes, and the volume was just right.",,ON,2. Moderately,2,2,0. Not at all,0,0,,1. A little,1,1. A little,1,2. Moderately,2,0. Not at all,0,4,0.25,0. Not at all,2,0,0. Not at all,0,3. Very much,3,3. Very much,3,0.125,control1,,,360,1,0. Not at all,1,0,0. Not at all,0,3. Very much,3,4. Extremely,4,0.0625,1. A little,1,1. A little,1,2. Moderately,2,0. Not at all,0,4,0.25,2. Moderately,2,2,0. Not at all,0,0,,,,,,,2. Moderately,2,2. Moderate quality each hour,2,1,1,1,,
1:22 PM,0.56,Moderatley boring,1,1. A little,6,1,1. A little,1,2. Moderately,2,2. Moderately,1,0.375,0. Not at all,2,0,0. Not at all,0,3. Very much,3,3. Very much,3,0.125,11,More than half the days,2,More than half the days,2,More than half the days,2,Several days,1,Not at all,0,More than half the days,2,More than half the days,2,3. Very,3,"No, I am not sick with an illness that could cause fatigue",0,"No, I did not stay up all night",0,3:00 AM,3:00 AM,11:00 AM,11:00 AM,7.99,2.37,8.5,8.5,9 hours,9,"Yes, and the volume was just right.",,ON,1. A little,1,1,0. Not at all,0,0,,3. Very,3,2. Moderately,2,1. A little,3,3. Very,3,11,0.6875,2. Moderately,10,2,2. Moderately,2,1. A little,1,1. A little,1,0.625,visualization,,,,0,0. Not at all,3,0,0. Not at all,0,2. Moderately,2,3. Very much,3,0.1875,1. A little,1,1. A little,1,0. Not at all,4,2. Moderately,2,8,0.5,2. Moderately,2,2,0. Not at all,0,0,,120,60,120,,,1. A little,1,2. Moderate quality each hour,2,0.5,0.5,1,,
4:22 PM,0.68,Very boring,2,1. A little,6,1,0. Not at all,0,0. Not at all,0,3. Very much,3,0.375,0. Not at all,0,0,0. Not at all,0,4. Extremely,4,4. Extremely,4,0,1,Not at all,0,Not at all,0,Not at all,0,Not at all,0,Not at all,0,Not at all,0,Several days,1,1. A little,1,"No, I am not sick with an illness that could cause fatigue",0,"No, I did not stay up all night",0,11:00 PM,11:00 PM,7:00 AM,7:00 AM,8,9.37,8,8,8 hours,8,"Yes, and the volume was just right.",,ON,3. Very much,3,3,0. Not at all,0,0,,0. Not at all,0,0. Not at all,0,0. Not at all,4,0. Not at all,0,4,0.25,0. Not at all,5,0,0. Not at all,0,0. Not at all,0,3. Very much,3,0.3125,visualization,,,,0,3. Very much,4,3,1. A little,1,4. Extremely,4,4. Extremely,4,0.25,2. Moderately,2,1. A little,1,1. A little,3,2. Moderately,2,8,0.5,1. A little,1,1,3. Very much,3,3,,120,60,120,,,3. Very,3,3. High quality each hour,3,0,1.5,-1,,
3:23 PM,0.64,Moderatley boring,1,0. Not at all,2,0,0. Not at all,0,3. Very much,3,3. Very much,3,0.125,0. Not at all,2,0,0. Not at all,0,3. Very much,3,3. Very much,3,0.125,0,Not at all,0,Not at all,0,Not at all,0,Not at all,0,Not at all,0,Not at all,0,Not at all,0,1. A little,1,"No, I am not sick with an illness that could cause fatigue",0,"No, I did not stay up all night",0,10:00 PM,10:00 PM,6:00 AM,6:00 AM,8,9.38,7,7,6 hours,6,"Yes, and the volume was just right.",,ON,3. Very much,3,3,0. Not at all,0,0,,1. A little,1,0. Not at all,0,2. Moderately,2,0. Not at all,0,3,0.1875,0. Not at all,2,0,0. Not at all,0,3. Very much,3,3. Very much,3,0.125,control2,,,360,1,0. Not at all,2,0,0. Not at all,0,3. Very much,3,3. Very much,3,0.125,0. Not at all,0,0. Not at all,0,2. Moderately,2,0. Not at all,0,2,0.125,3. Very much,3,3,0. Not at all,0,0,,,,,,,3. Very,3,3. High quality each hour,3,1,1.5,1.5,,
4:24 PM,0.68,Moderately interesting,-1,1. A little,3,1,0. Not at all,0,3. Very much,3,3. Very much,3,0.1875,1. A little,3,1,0. Not at all,0,3. Very much,3,3. Very much,3,0.1875,3,Several days,1,Several days,1,Several days,1,Not at all,0,Not at all,0,Not at all,0,Not at all,0,1. A little,1,"No, I am not sick with an illness that could cause fatigue",0,"No, I did not stay up all night",0,12:25 AM,12:25 AM,6:30 AM,6:30 AM,6.09,9.89,6,6,7 hours,7,"Yes, and the volume was just right.",,ON,2. Moderately,2,2,0. Not at all,0,0,,1. A little,1,1. A little,1,3. Very,1,1. A little,1,4,0.25,1. A little,4,1,0. Not at all,0,3. Very much,3,2. Moderately,2,0.25,PMR,"In this exercise, you will be tightening and relaxing muscle groups one by one, paying close attention to the difference between how they feel when tightened versus when relaxed. Many people find that this relaxation technique is surprisingly effective.","Before you begin, it's important to note that this exercise should not cause pain or discomfort. It works most effectively when your muscles are tensed at a medium-high intensity, about 70% of your strength. If you feel any discomfort, ease back until the discomfort disappears. If you find that it is painful, feel free to skip that particular muscle group. Also, remember to breathe naturally when tensing your muscles, without holding your breath.",,0,1. A little,3,1,0. Not at all,0,3. Very much,3,3. Very much,3,0.1875,1. A little,1,1. A little,1,3. Very,1,1. A little,1,4,0.25,2. Moderately,2,2,0. Not at all,0,0,,,,,,,2. Moderately,2,2. Moderate quality each hour,2,1,1,1,,
1:24 PM,0.56,Moderately interesting,-1,4. Extremely,10,4,3. Very much,3,2. Moderately,2,3. Very much,3,0.625,3. Very much,6,3,2. Moderately,2,4. Extremely,4,3. Very much,3,0.375,12,Nearly every day,3,More than half the days,2,Several days,1,Several days,1,More than half the days,2,Several days,1,More than half the days,2,2. Moderately,2,"No, I am not sick with an illness that could cause fatigue",0,"No, I did not stay up all night",0,10:25 PM,10:25 PM,6:26 AM,6:26 AM,8.02,6.96,8,8,6.5 hours,6.5,"Yes, but it was too loud or too quiet.",Yes,ON,3. Very much,3,3,3. Very much,3,3,,3. Very,3,4. Extremely,4,3. Very,1,1. A little,1,9,0.5625,3. Very much,10,3,4. Extremely,4,3. Very much,3,2. Moderately,2,0.625,control1,,,360,1,2. Moderately,9,2,4. Extremely,4,3. Very much,3,2. Moderately,2,0.5625,4. Extremely,4,3. Very,3,3. Very,1,2. Moderately,2,10,0.625,4. Extremely,4,4,3. Very much,3,3,,,,,,,3. Very,3,3. High quality each hour,3,1.5,0,0.5,,
4:26 PM,0.68,Moderately interesting,-1,0. Not at all,4,0,0. Not at all,0,2. Moderately,2,2. Moderately,1,0.25,0. Not at all,2,0,0. Not at all,0,3. Very much,3,3. Very much,3,0.125,0,Not at all,0,Not at all,0,Not at all,0,Not at all,0,Not at all,0,Not at all,0,Not at all,0,1. A little,1,"No, I am not sick with an illness that could cause fatigue",0,"No, I did not stay up all night",0,10:27 PM,10:27 PM,6:20 AM,6:20 AM,7.88,10.09,8,8,8 hours,8,"Yes, and the volume was just right.",,ON,3. Very much,3,3,0. Not at all,0,0,,0. Not at all,0,0. Not at all,0,2. Moderately,2,0. Not at all,0,2,0.125,0. Not at all,2,0,0. Not at all,0,3. Very much,3,3. Very much,3,0.125,control2,,,360,1,0. Not at all,3,0,0. Not at all,0,3. Very much,3,2. Moderately,2,0.1875,0. Not at all,0,0. Not at all,0,0. Not at all,4,0. Not at all,0,4,0.25,2. Moderately,2,2,0. Not at all,0,0,,,,,,,4. Extremely,4,4. Very high quality each hour,4,0,1.5,1,,
4:25 PM,0.68,Moderatley boring,1,0. Not at all,3,0,0. Not at all,0,2. Moderately,2,3. Very much,3,0.1875,3. Very much,15,3,4. Extremely,4,0. Not at all,0,0. Not at all,0,0.9375,16,More than half the days,2,Nearly every day,3,More than half the days,2,Nearly every day,3,More than half the days,2,More than half the days,2,More than half the days,2,1. A little,1,"Yes, I have a temporary illness that could cause fatigue",1,"No, I did not stay up all night",0,9:30 PM,9:30 PM,5:30 AM,5:30 AM,8,10.91,7,7,8 hours,8,"Yes, and the volume was just right.",,ON,1. A little,1,1,0. Not at all,0,0,,1. A little,1,1. A little,1,2. Moderately,2,1. A little,1,5,0.3125,1. A little,8,1,2. Moderately,2,1. A little,1,2. Moderately,2,0.5,visualization,,,,0,1. A little,3,1,0. Not at all,0,3. Very much,3,3. Very much,3,0.1875,0. Not at all,0,0. Not at all,0,3. Very,1,3. Very,3,4,0.25,2. Moderately,2,2,0. Not at all,0,0,,120,60,120,,flu,0. Not at all,0,1. Low quality each hour,1,1,0.5,1,,
1:25 PM,0.56,Moderatley boring,1,0. Not at all,3,0,0. Not at all,0,3. Very much,3,2. Moderately,1,0.1875,0. Not at all,2,0,0. Not at all,0,3. Very much,3,3. Very much,3,0.125,0,Not at all,0,Not at all,0,Not at all,0,Not at all,0,Not at all,0,Not at all,0,Not at all,0,0. Not at all,0,"No, I am not sick with an illness that could cause fatigue",0,"No, I did not stay up all night",0,1:27 PM,10:00 PM,10:00 PM,5:31 AM,16.07,7.9,7.5,7.5,8 hours,8,"Yes, and the volume was just right.",,ON,2. Moderately,2,2,0. Not at all,0,0,,0. Not at all,0,0. Not at all,0,3. Very,1,0. Not at all,0,1,0.0625,0. Not at all,4,0,0. Not at all,0,2. Moderately,2,2. Moderately,2,0.25,control2,,,360,1,0. Not at all,2,0,0. Not at all,0,3. Very much,3,3. Very much,3,0.125,0. Not at all,0,0. Not at all,0,4. Extremely,0,0. Not at all,0,0,0,2. Moderately,2,2,0. Not at all,0,0,,,,,,,3. Very,3,3. High quality each hour,3,0.5,1,1,,
3:26 PM,0.64,Very boring,2,0. Not at all,2,0,0. Not at all,0,3. Very much,3,3. Very much,3,0.125,0. Not at all,4,0,1. A little,1,3. Very much,3,2. Moderately,2,0.25,2,Not at all,0,Not at all,0,Not at all,0,Several days,1,Several days,1,Not at all,0,Not at all,0,1. A little,1,"No, I am not sick with an illness that could cause fatigue",0,"No, I did not stay up all night",0,11:27 PM,11:27 PM,8:27 AM,8:27 AM,9,6.98,9,9,8 hours,8,"Yes, and the volume was just right.",,ON,2. Moderately,2,2,1. A little,1,1,,1. A little,1,1. A little,1,3. Very,1,0. Not at all,0,3,0.1875,0. Not at all,3,0,1. A little,1,3. Very much,3,3. Very much,3,0.1875,visualization,,,,0,0. Not at all,2,0,0. Not at all,0,3. Very much,3,3. Very much,3,0.125,1. A little,1,1. A little,1,3. Very,1,1. A little,1,4,0.25,3. Very much,3,3,1. A little,1,1,,120,60,120,,,2. Moderately,2,2. Moderate quality each hour,2,1,0.5,1,,
4:28 PM,0.69,Very interesting,-2,0. Not at all,4,0,0. Not at all,0,3. Very much,3,1. A little,1,0.25,1. A little,3,1,0. Not at all,0,3. Very much,3,3. Very much,3,0.1875,2,Not at all,0,Not at all,0,Not at all,0,Several days,1,Not at all,0,Several days,1,Not at all,0,1. A little,1,"No, I am not sick with an illness that could cause fatigue",0,"No, I did not stay up all night",0,12:29 AM,12:29 AM,6:44 AM,6:44 AM,6.25,9.75,6,6,7 hours,7,"Yes, and the volume was just right.",,ON,2. Moderately,2,2,0. Not at all,0,0,,0. Not at all,0,1. A little,1,3. Very,1,0. Not at all,0,2,0.125,0. Not at all,4,0,0. Not at all,0,2. Moderately,2,2. Moderately,2,0.25,visualization,,,,0,0. Not at all,4,0,0. Not at all,0,2. Moderately,2,2. Moderately,2,0.25,1. A little,1,1. A little,1,2. Moderately,2,0. Not at all,0,4,0.25,2. Moderately,2,2,0. Not at all,0,0,,120,60,120,,,2. Moderately,2,2. Moderate quality each hour,2,1,1,1,,
1:33 PM,0.56,Moderately interesting,-1,0. Not at all,8,0,0. Not at all,0,0. Not at all,0,0. Not at all,0,0.5,0. Not at all,5,0,1. A little,1,3. Very much,3,1. A little,1,0.3125,1,Several days,1,Not at all,0,Not at all,0,Not at all,0,Not at all,0,Not at all,0,Not at all,0,1. A little,1,"No, I am not sick with an illness that could cause fatigue",0,"No, I did not stay up all night",0,10:00 PM,10:00 PM,5:30 AM,5:30 AM,7.51,8.05,7,7,7 hours,7,"Yes, and the volume was just right.",,ON,2. Moderately,2,2,0. Not at all,0,0,,0. Not at all,0,0. Not at all,0,3. Very,1,0. Not at all,0,1,0.0625,0. Not at all,3,0,1. A little,1,3. Very much,3,3. Very much,3,0.1875,PMR,"In this exercise, you will be tightening and relaxing muscle groups one by one, paying close attention to the difference between how they feel when tightened versus when relaxed. Many people find that this relaxation technique is surprisingly effective.","Before you begin, it's important to note that this exercise should not cause pain or discomfort. It works most effectively when your muscles are tensed at a medium-high intensity, about 70% of your strength. If you feel any discomfort, ease back until the discomfort disappears. If you find that it is painful, feel free to skip that particular muscle group. Also, remember to breathe naturally when tensing your muscles, without holding your breath.",,0,0. Not at all,0,0,0. Not at all,0,4. Extremely,4,4. Extremely,4,0,4. Extremely,4,4. Extremely,4,4. Extremely,0,0. Not at all,0,8,0.5,4. Extremely,4,4,0. Not at all,0,0,,,,,,,4. Extremely,4,3. High quality each hour,3,0,1,2,,